[arch-dev-public] [core] build status

Allan McRae allan at archlinux.org
Wed Dec 26 03:12:22 EST 2012

Here is a base line of the failures to build for packages in [core]
before I push a new toolchain:

FAIL:  ca-certificates
Source not available

FAIL:  e2fsprogs
Needs "make -j1 install" or I get the following:
/usr/bin/install: cannot create regular file
'/build/pkg/usr/lib/libcom_err.so.2.1': File exists

FAIL:  licenses
many checksum failures

FAIL:  net-tools
strip.c:24:28: fatal error: linux/if_strip.h: No such file or directory

FAIL:  openldap
(test-suite always fails on pkgbuild.com)

FAIL:  pcmciautils
pcmciautils-018.tar.xz ... FAILED

FAIL:  ppl
build failure caused by updated gmp - e.g.
mp_std_bits.defs.hh:108:7: error: redefinition of 'class
std::numeric_limits<__gmp_expr<__mpq_struct [1], __mpq_struct [1]> >'
/usr/include/gmpxx.h:3306:21: error: previous definition of 'class
std::numeric_limits<__gmp_expr<__mpq_struct [1], __mpq_struct [1]> >'


More information about the arch-dev-public mailing list