[arch-general] Failed to compile Emacs

Leonid Isaev lisaev at umail.iu.edu
Sat Jul 14 16:12:02 EDT 2012

On Sun, 15 Jul 2012 02:21:47 +0700
Diep Pham Van <imeo at favadi.com> wrote:

> Hello every one, 
> I've tried to compile emacs and fail.
> You can view the `makepkg -s` ouput here[1].
> I think the important part here:
> ./stdio.h:1030:1: error: ‘gets’ undeclared here (not in a function)
> In file included from md5.h:24:0,
>                  from md5.c:25:
> ./stdio.h:1030:1: error: ‘gets’ undeclared here (not in a function)
> make[2]: *** [sha1.o] Error 1
> make[2]: *** Waiting for unfinished jobs....
> make[2]: *** [md5.o] Error 1
> mv -f .deps/careadlinkat.Tpo .deps/careadlinkat.Po
> In file included from sha256.h:21:0,
>                  from sha256.c:25:
> ./stdio.h:1030:1: error: ‘gets’ undeclared here (not in a function)
> make: *** [lib] Error 2
> I do not to know what to do here. Any one can help me with this?
> [1] https://gist.github.com/3112844

A simple google search yields this:
Does it answer your question?

Leonid Isaev
GnuPG key: 0x164B5A6D
Fingerprint: C0DF 20D0 C075 C3F1 E1BE  775A A7AE F6CB 164B 5A6D
-------------- next part --------------
A non-text attachment was scrubbed...
Name: signature.asc
Type: application/pgp-signature
Size: 490 bytes
Desc: not available
URL: <http://mailman.archlinux.org/pipermail/arch-general/attachments/20120714/c9422094/attachment.asc>

More information about the arch-general mailing list