[aur-dev] apvlv: build problems

Stefan Husmann stefan-husmann at t-online.de
Sun Oct 9 16:23:40 EDT 2011


sorry for being late with the rebuild of apvlv for poppler 0.18.  There is a nontrivial problem building it. I sent an e-Mail to the author, but I guess a rewrite of bigger parts of apvlv is needed. Maybe it has to be dropped from [community].

Regards Stefan  

--   found poppler-glib, version 0.18.0
-- Configuring done
-- Generating done
-- Build files have been written to: /build/src/apvlv-0.1.2-Source/build
Scanning dependencies of target apvlv
[  8%] Building CXX object src/CMakeFiles/apvlv.dir/ApvlvCmds.cpp.o
[ 16%] Building CXX object src/CMakeFiles/apvlv.dir/ApvlvCore.cpp.o
[ 25%] Building CXX object src/CMakeFiles/apvlv.dir/ApvlvDir.cpp.o
/build/src/apvlv-0.1.2-Source/src/ApvlvDir.cpp: In member function ‘void apvlv::ApvlvDir::apvlv_dir_change_node(apvlv::ApvlvDirNode*, GFile*, GFileMonitorEvent)’:
/build/src/apvlv-0.1.2-Source/src/ApvlvDir.cpp:934:56: warning: ‘nnode’ may be used uninitialized in this function [-Wuninitialized]
[ 33%] Building CXX object src/CMakeFiles/apvlv.dir/ApvlvDoc.cpp.o
[ 41%] Building CXX object src/CMakeFiles/apvlv.dir/ApvlvFile.cpp.o
/build/src/apvlv-0.1.2-Source/src/ApvlvFile.cpp: In member function ‘virtual bool apvlv::ApvlvPDF::pagetext(int, int, int, int, int, char**)’:
/build/src/apvlv-0.1.2-Source/src/ApvlvFile.cpp:307:68: error: too many arguments to function ‘char* poppler_page_get_text(PopplerPage*)’
/usr/include/poppler/glib/poppler-page.h:67:24: note: declared here
/build/src/apvlv-0.1.2-Source/src/ApvlvFile.cpp: In member function ‘virtual bool apvlv::ApvlvPDF::render(int, int, int, double, int, GdkPixbuf*, char*)’:
/build/src/apvlv-0.1.2-Source/src/ApvlvFile.cpp:326:67: error: ‘poppler_page_render_to_pixbuf’ was not declared in this scope
make[2]: *** [src/CMakeFiles/apvlv.dir/ApvlvFile.cpp.o] Error 1
make[1]: *** [src/CMakeFiles/apvlv.dir/all] Error 2

More information about the aur-dev mailing list