[pacman-dev] [PATCH 6/6] add pacman-db-upgrade test

Allan McRae allan at archlinux.org
Mon Oct 20 06:33:29 UTC 2014

On 08/10/14 16:39, Andrew Gregory wrote:
> Signed-off-by: Andrew Gregory <andrew.gregory.8 at gmail.com>

Hi Andrew,

"make distcheck" fails with this patch:

make[5]: Nothing to be done for 'test/scripts/pacman-db-upgrade-v9.log'.
fatal: making test/test-suite.log: failed to create
fatal: making test/test-suite.log: failed to create
Makefile:1046: recipe for target 'test/test-suite.log' failed
make[4]: *** [test/test-suite.log] Error 1
Makefile:1152: recipe for target 'check-TESTS' failed
make[3]: *** [check-TESTS] Error 2
Makefile:1404: recipe for target 'check-am' failed
make[2]: *** [check-am] Error 2
Makefile:932: recipe for target 'check-recursive' failed
make[1]: *** [check-recursive] Error 1
Makefile:1322: recipe for target 'distcheck' failed
make: *** [distcheck] Error 1

More information about the pacman-dev mailing list