[pacman-dev] Fwd: Problem installing pacman-4.2.0 and 4.2.1

Michaila Goula-Dimitriou mixagd777 at gmail.com
Fri Jan 15 22:44:09 UTC 2016


I am not sure if this is a bug but trying the "make" command on both 4.2.0
and 4.2.1 versions of packman gave me the exact same error:

callback.o: In function `get_time_ms':
/home/mixa/pacman-4.2.1/src/pacman/callback.c:59: undefined reference to
collect2: ld returned 1 exit status
make[3]: *** [pacman] Error 1
make[2]: *** [all-recursive] Error 1
make[1]: *** [all-recursive] Error 1
make: *** [all] Error 2

Is there something to do in order to fix this?

Thank you.
Goula-Dimitriou Michaila

More information about the pacman-dev mailing list